{"text_format":"1","workbook":"xlsx","n_sheets":4,"sheets":["ユーザー登録フォーム","Macro1","main","item"],"not_rendered":{"charts":0,"images":0,"macros":1,"external_links":1,"defined_names":8,"comments":0,"pivot_tables":0},"unopened":[],"bounds":{"document_bytes":16777216,"sheet_cells":100000,"rows_first":2000,"rows_last":500,"rows_between":2000,"halvings":0,"cell_chars":16384,"cell_head_chars":4096},"cells_cut":0,"cells_raw":0,"read":"whole","date_system":"1900"}

{"sheet":"ユーザー登録フォーム","index":0,"n_rows":41,"n_cols":5,"rows_kept":41,"cut":false,"hidden":true,"merged":[]}
["ユーザー登録フォーム"]
[]
["企業情報"]
[]
[null,"企業名","必須",null,"プロバランス株式会社"]
[null,null,null,null,"例: 有限会社ポートフォリオ"]
[null,null,null,null,"個人事業主の場合は屋号を入力してください"]
[]
[null,"企業名かな","必須",null,"ﾌﾟﾛﾊﾞﾗﾝｽ"]
[null,null,null,null,"個人事業主の場合は屋号を入力してください"]
[]
[null,"郵便番号","必須",null,"aaa"]
[]
[]
[null,"住所 ","必須",null,"東京都港区"]
[]
[null,"電話番号","必須",null,31234444]
[]
[]
["ユーザー情報"]
[]
[null,"氏名","必須",null,"大坂1"]
[]
[null,"メールアドレス","必須",null,"osaka@muve.co.jp"]
[]
[null,"メールアドレス（確認）","必須",null,"osaka@muve.co.jp"]
[]
[null,"パスワード","必須",null,"ttest"]
[]
["利用規約"]
[]
[]
[]
[]
[]
[]
[]
[]
[null,"有効期限",null,null,"2020-12-31"]
[]
[null,"アクセストークン",null,null,"test"]

{"sheet":"Macro1","index":1,"n_rows":0,"n_cols":0,"rows_kept":0,"cut":false,"hidden":false,"merged":[]}

{"sheet":"main","index":2,"n_rows":10,"n_cols":6,"rows_kept":10,"cut":false,"hidden":false,"merged":[]}
[null,"url","https://www.amazon.co.jp/dp/@asin@"]
[null,"root","div[id=dp-container]"]
[null,"selector","[{\"target\":\"span[id=productTitle]\",\"key\":\"\",\"type\":\"text\",\"alias_name\":\"name\"},{\"target\":\"div[id=price] > table > tbody > tr > td > span\",\"key\":\"\",\"type\":\"text\",\"alias_name\":\"price\"},{\"target\":\"a[id=bylineInfo]\",\"key\":\"\",\"type\":\"text\",\"alias_name\":\"brand\"}]"]
[null,"start_row",11]
[]
["target",{"$f":"VLOOKUP(B9,item!A:D,4,FALSE)&\"\"","v":"me"},{"$f":"VLOOKUP(C9,item!A:D,4,FALSE)&\"\"","v":"me"},{"$f":"VLOOKUP(D9,item!A:D,4,FALSE)&\"\"","v":"span[id=productTitle]"},{"$f":"VLOOKUP(E9,item!A:D,4,FALSE)&\"\"","v":"div[id=price] > table > tbody > tr > td > span"},{"$f":"VLOOKUP(F9,item!A:D,4,FALSE)&\"\"","v":"a[id=bylineInfo]"}]
["key",{"$f":"VLOOKUP(B9,item!A:D,3,FALSE)&\"\"","v":""},{"$f":"VLOOKUP(C9,item!A:D,3,FALSE)&\"\"","v":"data-asin"},{"$f":"VLOOKUP(D9,item!A:D,3,FALSE)&\"\"","v":""},{"$f":"VLOOKUP(E9,item!A:D,3,FALSE)&\"\"","v":""},{"$f":"VLOOKUP(F9,item!A:D,3,FALSE)&\"\"","v":""}]
["type",{"$f":"VLOOKUP(B9,item!A:D,2,FALSE)&\"\"","v":"count"},{"$f":"VLOOKUP(C9,item!A:D,2,FALSE)&\"\"","v":"attribute"},{"$f":"VLOOKUP(D9,item!A:D,2,FALSE)&\"\"","v":"text"},{"$f":"VLOOKUP(E9,item!A:D,2,FALSE)&\"\"","v":"text"},{"$f":"VLOOKUP(F9,item!A:D,2,FALSE)&\"\"","v":"text"}]
["alias_name","no","asin","name","price","brand"]
[null,"#","asin","商品名","価格","メーカー"]

{"sheet":"item","index":3,"n_rows":6,"n_cols":4,"rows_kept":6,"cut":false,"hidden":true,"merged":[]}
["alias_name","type","key","target"]
["no","count",null,"me"]
["asin","attribute","data-asin","me"]
["name","text",null,"span[id=productTitle]"]
["price","text",null,"div[id=price] > table > tbody > tr > td > span"]
["brand","text",null,"a[id=bylineInfo]"]